
   PASS  Tests\Unit\ExampleTest
  ✓ that true is true                                                    0.76s  

   PASS  Tests\Unit\RiskEngineTest
  ✓ risk engine returns deterministic score and band from the active ma… 0.09s  
  ✓ risk engine returns null for an unmapped cell                        0.02s  
  ✓ active matrix prefers tenant-specific matrix over system default     0.02s  

   PASS  Tests\Feature\AuditSurveyTest
  ✓ authenticated user can view audits index                             4.18s  
  ✓ authenticated user can view surveys index                            6.95s  
  ✓ audit workflow rejects invalid transition                            6.80s  

   PASS  Tests\Feature\Auth\AuthenticationTest
  ✓ login screen can be rendered                                         0.12s  
  ✓ users can authenticate using the login screen                        0.15s  
  ✓ users can not authenticate with invalid password                     0.33s  
  ✓ users can logout                                                     0.10s  

   PASS  Tests\Feature\Auth\EmailVerificationTest
  ✓ email verification screen can be rendered                            0.14s  
  ✓ email can be verified                                                0.13s  
  ✓ email is not verified with invalid hash                              0.12s  

   PASS  Tests\Feature\Auth\PasswordConfirmationTest
  ✓ confirm password screen can be rendered                              0.13s  
  ✓ password can be confirmed                                            0.11s  
  ✓ password is not confirmed with invalid password                      0.30s  

   PASS  Tests\Feature\Auth\PasswordResetTest
  ✓ reset password link screen can be rendered                           0.12s  
  ✓ reset password link can be requested                                 0.31s  
  ✓ reset password screen can be rendered                                0.34s  
  ✓ password can be reset with valid token                               0.33s  

   PASS  Tests\Feature\Auth\PasswordUpdateTest
  ✓ password can be updated                                              0.13s  
  ✓ correct password must be provided to update password                 0.11s  

   PASS  Tests\Feature\Auth\RegistrationTest
  ✓ registration screen can be rendered                                  0.12s  
  ✓ new users can register                                               0.10s  

   PASS  Tests\Feature\DocumentTest
  ✓ authenticated user can view documents index                          6.72s  

   PASS  Tests\Feature\ExampleTest
  ✓ it returns a successful response                                     0.10s  

   PASS  Tests\Feature\GuideTest
  ✓ guide is accessible to system admin                                  7.33s  
  ✓ guide is forbidden for general employee                              7.06s  

   PASS  Tests\Feature\HazardTest
  ✓ safety officer can create a hazard with a generated reference        7.46s  
  ✓ authenticated user can view hazard index                             5.92s  
  ✓ hazard matching finds existing hazards and taxonomy synonyms         4.32s  
  ✓ relationship service records idempotent source provenance            6.87s  
  ✓ relationship service rejects unknown relationship types              6.70s  
  ✓ hazard transition follows the lifecycle state machine                6.74s  

   PASS  Tests\Feature\InvestigationTest
  ✓ authenticated user can view investigations index                     7.03s  
  ✓ investigation service rejects invalid transition                     6.87s  

   PASS  Tests\Feature\MocTest
  ✓ authenticated user can view moc index                                6.72s  
  ✓ moc service rejects closing before effectiveness review              6.75s  

   PASS  Tests\Feature\NotificationTest
  ✓ authenticated user can view notifications index                      6.80s  
  ✓ notification service sends and counts unread                         6.60s  
  ✓ notification service escalates to safety and executive roles         6.66s  

   PASS  Tests\Feature\ProfileTest
  ✓ profile page is displayed                                            0.21s  
  ✓ profile information can be updated                                   0.11s  
  ✓ email verification status is unchanged when the email address is un… 0.13s  
  ✓ user can delete their account                                        0.13s  
  ✓ correct password must be provided to delete account                  0.14s  

   FAIL  Tests\Feature\RecommendationTest
  ✓ safety manager can issue a recommendation with a generated referenc… 7.50s  
  ✓ recommendation response requires justification and a valid response  6.71s  
  ⨯ authenticated user can view recommendations index                   12.38s  

   PASS  Tests\Feature\RecordTest
  ✓ authenticated user can view records index                            6.80s  
  ✓ compliance service returns expired for a past-due record             6.83s  
  ✓ compliance service returns due soon within reminder window           6.93s  

   PASS  Tests\Feature\ReportingTest
  ✓ authenticated user can view reports index                            6.81s  
  ✓ guest is redirected to login                                         7.11s  
  ✓ anonymous report stores no reporter identity                         7.20s  
  ✓ identified report binds the authenticated reporter                   6.86s  
  ✓ report narrative is limited to 1000 characters                       7.25s  
  ✓ risk assessment store computes deterministic index from matrix       7.77s  
  ✓ report persists escalation flags                                     6.92s  
  ✓ safety officer can triage a submitted report                         7.72s  
  ✓ invalid report transition is rejected                                7.80s  
  ✓ reclassification requires a reason and records history               7.57s  

   PASS  Tests\Feature\RiskDispositionTest
  ✓ safety officer can link a new hazard to a report                     7.99s  
  ✓ safety officer can link an existing hazard to a report               7.26s  
  ✓ risk disposition is recorded with rationale validation for no_furth… 7.21s  
  ✓ conduct risk assessment redirects to prefilled assessment create     7.26s  
  ✓ general employee cannot record a risk disposition                    7.27s  

   PASS  Tests\Feature\RiskLinkTest
  ✓ risk assessment can link an entity                                   7.26s  

   PASS  Tests\Feature\RiskWorkflowTest
  ✓ assignment moves assessment to awaiting_risk_owner                   6.98s  
  ✓ residual assessment is a separate row linked via parent_id           6.57s  
  ✓ acceptance records decision and routes rejected back to risk owner   6.71s  
  ✓ closure gate blocks when mitigations are still in progress           6.52s  
  ✓ ineffective mitigation drives assessment to ineffective, not closed  6.72s  

   PASS  Tests\Feature\SearchTest
  ✓ authenticated user can view search page                              7.00s  
  ✓ search returns matching reports                                      6.81s  

   PASS  Tests\Feature\SpiAdminTest
  ✓ authenticated user can view spi index                                7.00s  
  ✓ authenticated user can view admin index                              6.95s  

   PASS  Tests\Feature\TrainingTest
  ✓ authenticated user can view training index                           6.91s  
  ────────────────────────────────────────────────────────────────────────────  
   FAILED  Tests\Feature\RecommendationTest > authenticated user can view re…   
  Expected response status code [200] but received 500.
Failed asserting that 500 is identical to 200.

The following exception occurred during the last request:

Illuminate\Foundation\ViteException: Unable to locate file in Vite manifest: resources/js/Pages/Recommendations/Index.tsx. in C:\Users\Tech_rtadmin\AeroQSMS\aeroqsms\vendor\laravel\framework\src\Illuminate\Foundation\Vite.php:999
Stack trace:
#0 C:\Users\Tech_rtadmin\AeroQSMS\aeroqsms\vendor\laravel\framework\src\Illuminate\Foundation\Vite.php(390): Illuminate\Foundation\Vite->chunk(Array, 'resources/js/Pa...')
#1 C:\Users\Tech_rtadmin\AeroQSMS\aeroqsms\storage\framework\views\d0a2656570185eb85f797b6a8cd01dab.php(16): Illuminate\Foundation\Vite->__invoke(Object(Illuminate\Support\Collection))
#2 C:\Users\Tech_rtadmin\AeroQSMS\aeroqsms\vendor\laravel\framework\src\Illuminate\Filesystem\Filesystem.php(123): require('C:\\Users\\Tech_r...')
#3 C:\Users\Tech_rtadmin\AeroQSMS\aeroqsms\vendor\laravel\framework\src\Illuminate\Filesystem\Filesystem.php(124): Illuminate\Filesystem\Filesystem::Illuminate\Filesystem\{closure}()
#4 C:\Users\Tech_rtadmin\AeroQSMS\aeroqsms\vendor\laravel\framework\src\Illuminate\View\Engines\PhpEngine.php(57): Illuminate\Filesystem\Filesystem->getRequire('C:\\Users\\Tech_r...', Array)
#5 C:\Users\Tech_rtadmin\AeroQSMS\aeroqsms\vendor\laravel\framework\src\Illuminate\View\Engines\CompilerEngine.php(76): Illuminate\View\Engines\PhpEngine->evaluatePath('C:\\Users\\Tech_r...', Array)
#6 C:\Users\Tech_rtadmin\AeroQSMS\aeroqsms\vendor\laravel\framework\src\Illuminate\View\View.php(208): Illuminate\View\Engines\CompilerEngine->get('C:\\Users\\Tech_r...', Array)
#7 C:\Users\Tech_rtadmin\AeroQSMS\aeroqsms\vendor\laravel\framework\src\Illuminate\View\View.php(191): Illuminate\View\View->getContents()
#8 C:\Users\Tech_rtadmin\AeroQSMS\aeroqsms\vendor\laravel\framework\src\Illuminate\View\View.php(160): Illuminate\View\View->renderContents()
#9 C:\Users\Tech_rtadmin\AeroQSMS\aeroqsms\vendor\laravel\framework\src\Illuminate\Http\Response.php(78): Illuminate\View\View->render()
#10 C:\Users\Tech_rtadmin\AeroQSMS\aeroqsms\vendor\laravel\framework\src\Illuminate\Http\Response.php(34): Illuminate\Http\Response->setContent(Object(Illuminate\View\View))
#11 C:\Users\Tech_rtadmin\AeroQSMS\aeroqsms\vendor\laravel\framework\src\Illuminate\Routing\ResponseFactory.php(61): Illuminate\Http\Response->__construct(Object(Illuminate\View\View), 200, Array)
#12 C:\Users\Tech_rtadmin\AeroQSMS\aeroqsms\vendor\laravel\framework\src\Illuminate\Routing\ResponseFactory.php(91): Illuminate\Routing\ResponseFactory->make(Object(Illuminate\View\View), 200, Array)
#13 C:\Users\Tech_rtadmin\AeroQSMS\aeroqsms\vendor\laravel\framework\src\Illuminate\Support\Facades\Facade.php(363): Illuminate\Routing\ResponseFactory->view('app', Array)
#14 C:\Users\Tech_rtadmin\AeroQSMS\aeroqsms\vendor\inertiajs\inertia-laravel\src\Response.php(219): Illuminate\Support\Facades\Facade::__callStatic('view', Array)
#15 C:\Users\Tech_rtadmin\AeroQSMS\aeroqsms\vendor\laravel\framework\src\Illuminate\Routing\Router.php(921): Inertia\Response->toResponse(Object(Illuminate\Http\Request))
#16 C:\Users\Tech_rtadmin\AeroQSMS\aeroqsms\vendor\laravel\framework\src\Illuminate\Routing\Router.php(906): Illuminate\Routing\Router::toResponse(Object(Illuminate\Http\Request), Object(Inertia\Response))
#17 C:\Users\Tech_rtadmin\AeroQSMS\aeroqsms\vendor\laravel\framework\src\Illuminate\Routing\Router.php(821): Illuminate\Routing\Router->prepareResponse(Object(Illuminate\Http\Request), Object(Inertia\Response))
#18 C:\Users\Tech_rtadmin\AeroQSMS\aeroqsms\vendor\laravel\framework\src\Illuminate\Pipeline\Pipeline.php(180): Illuminate\Routing\Router->Illuminate\Routing\{closure}(Object(Illuminate\Http\Request))
#19 C:\Users\Tech_rtadmin\AeroQSMS\aeroqsms\vendor\laravel\framework\src\Illuminate\Auth\Middleware\EnsureEmailIsVerified.php(41): Illuminate\Pipeline\Pipeline->Illuminate\Pipeline\{closure}(Object(Illuminate\Http\Request))
#20 C:\Users\Tech_rtadmin\AeroQSMS\aeroqsms\vendor\laravel\framework\src\Illuminate\Pipeline\Pipeline.php(219): Illuminate\Auth\Middleware\EnsureEmailIsVerified->handle(Object(Illuminate\Http\Request), Object(Closure))
#21 C:\Users\Tech_rtadmin\AeroQSMS\aeroqsms\vendor\laravel\framework\src\Illuminate\Http\Middleware\AddLinkHeadersForPreloadedAssets.php(32): Illuminate\Pipeline\Pipeline->Illuminate\Pipeline\{closure}(Object(Illuminate\Http\Request))
#22 C:\Users\Tech_rtadmin\AeroQSMS\aeroqsms\vendor\laravel\framework\src\Illuminate\Pipeline\Pipeline.php(219): Illuminate\Http\Middleware\AddLinkHeadersForPreloadedAssets->handle(Object(Illuminate\Http\Request), Object(Closure))
#23 C:\Users\Tech_rtadmin\AeroQSMS\aeroqsms\app\Http\Middleware\EnsureAccountActive.php(26): Illuminate\Pipeline\Pipeline->Illuminate\Pipeline\{closure}(Object(Illuminate\Http\Request))
#24 C:\Users\Tech_rtadmin\AeroQSMS\aeroqsms\vendor\laravel\framework\src\Illuminate\Pipeline\Pipeline.php(219): App\Http\Middleware\EnsureAccountActive->handle(Object(Illuminate\Http\Request), Object(Closure))
#25 C:\Users\Tech_rtadmin\AeroQSMS\aeroqsms\vendor\inertiajs\inertia-laravel\src\Middleware.php(122): Illuminate\Pipeline\Pipeline->Illuminate\Pipeline\{closure}(Object(Illuminate\Http\Request))
#26 C:\Users\Tech_rtadmin\AeroQSMS\aeroqsms\vendor\laravel\framework\src\Illuminate\Pipeline\Pipeline.php(219): Inertia\Middleware->handle(Object(Illuminate\Http\Request), Object(Closure))
#27 C:\Users\Tech_rtadmin\AeroQSMS\aeroqsms\vendor\laravel\framework\src\Illuminate\Routing\Middleware\SubstituteBindings.php(50): Illuminate\Pipeline\Pipeline->Illuminate\Pipeline\{closure}(Object(Illuminate\Http\Request))
#28 C:\Users\Tech_rtadmin\AeroQSMS\aeroqsms\vendor\laravel\framework\src\Illuminate\Pipeline\Pipeline.php(219): Illuminate\Routing\Middleware\SubstituteBindings->handle(Object(Illuminate\Http\Request), Object(Closure))
#29 C:\Users\Tech_rtadmin\AeroQSMS\aeroqsms\vendor\laravel\framework\src\Illuminate\Auth\Middleware\Authenticate.php(63): Illuminate\Pipeline\Pipeline->Illuminate\Pipeline\{closure}(Object(Illuminate\Http\Request))
#30 C:\Users\Tech_rtadmin\AeroQSMS\aeroqsms\vendor\laravel\framework\src\Illuminate\Pipeline\Pipeline.php(219): Illuminate\Auth\Middleware\Authenticate->handle(Object(Illuminate\Http\Request), Object(Closure))
#31 C:\Users\Tech_rtadmin\AeroQSMS\aeroqsms\vendor\laravel\framework\src\Illuminate\Foundation\Http\Middleware\VerifyCsrfToken.php(87): Illuminate\Pipeline\Pipeline->Illuminate\Pipeline\{closure}(Object(Illuminate\Http\Request))
#32 C:\Users\Tech_rtadmin\AeroQSMS\aeroqsms\vendor\laravel\framework\src\Illuminate\Pipeline\Pipeline.php(219): Illuminate\Foundation\Http\Middleware\VerifyCsrfToken->handle(Object(Illuminate\Http\Request), Object(Closure))
#33 C:\Users\Tech_rtadmin\AeroQSMS\aeroqsms\vendor\laravel\framework\src\Illuminate\View\Middleware\ShareErrorsFromSession.php(48): Illuminate\Pipeline\Pipeline->Illuminate\Pipeline\{closure}(Object(Illuminate\Http\Request))
#34 C:\Users\Tech_rtadmin\AeroQSMS\aeroqsms\vendor\laravel\framework\src\Illuminate\Pipeline\Pipeline.php(219): Illuminate\View\Middleware\ShareErrorsFromSession->handle(Object(Illuminate\Http\Request), Object(Closure))
#35 C:\Users\Tech_rtadmin\AeroQSMS\aeroqsms\vendor\laravel\framework\src\Illuminate\Session\Middleware\StartSession.php(120): Illuminate\Pipeline\Pipeline->Illuminate\Pipeline\{closure}(Object(Illuminate\Http\Request))
#36 C:\Users\Tech_rtadmin\AeroQSMS\aeroqsms\vendor\laravel\framework\src\Illuminate\Session\Middleware\StartSession.php(63): Illuminate\Session\Middleware\StartSession->handleStatefulRequest(Object(Illuminate\Http\Request), Object(Illuminate\Session\Store), Object(Closure))
#37 C:\Users\Tech_rtadmin\AeroQSMS\aeroqsms\vendor\laravel\framework\src\Illuminate\Pipeline\Pipeline.php(219): Illuminate\Session\Middleware\StartSession->handle(Object(Illuminate\Http\Request), Object(Closure))
#38 C:\Users\Tech_rtadmin\AeroQSMS\aeroqsms\vendor\laravel\framework\src\Illuminate\Cookie\Middleware\AddQueuedCookiesToResponse.php(36): Illuminate\Pipeline\Pipeline->Illuminate\Pipeline\{closure}(Object(Illuminate\Http\Request))
#39 C:\Users\Tech_rtadmin\AeroQSMS\aeroqsms\vendor\laravel\framework\src\Illuminate\Pipeline\Pipeline.php(219): Illuminate\Cookie\Middleware\AddQueuedCookiesToResponse->handle(Object(Illuminate\Http\Request), Object(Closure))
#40 C:\Users\Tech_rtadmin\AeroQSMS\aeroqsms\vendor\laravel\framework\src\Illuminate\Cookie\Middleware\EncryptCookies.php(74): Illuminate\Pipeline\Pipeline->Illuminate\Pipeline\{closure}(Object(Illuminate\Http\Request))
#41 C:\Users\Tech_rtadmin\AeroQSMS\aeroqsms\vendor\laravel\framework\src\Illuminate\Pipeline\Pipeline.php(219): Illuminate\Cookie\Middleware\EncryptCookies->handle(Object(Illuminate\Http\Request), Object(Closure))
#42 C:\Users\Tech_rtadmin\AeroQSMS\aeroqsms\vendor\laravel\framework\src\Illuminate\Pipeline\Pipeline.php(137): Illuminate\Pipeline\Pipeline->Illuminate\Pipeline\{closure}(Object(Illuminate\Http\Request))
#43 C:\Users\Tech_rtadmin\AeroQSMS\aeroqsms\vendor\laravel\framework\src\Illuminate\Routing\Router.php(821): Illuminate\Pipeline\Pipeline->then(Object(Closure))
#44 C:\Users\Tech_rtadmin\AeroQSMS\aeroqsms\vendor\laravel\framework\src\Illuminate\Routing\Router.php(800): Illuminate\Routing\Router->runRouteWithinStack(Object(Illuminate\Routing\Route), Object(Illuminate\Http\Request))
#45 C:\Users\Tech_rtadmin\AeroQSMS\aeroqsms\vendor\laravel\framework\src\Illuminate\Routing\Router.php(764): Illuminate\Routing\Router->runRoute(Object(Illuminate\Http\Request), Object(Illuminate\Routing\Route))
#46 C:\Users\Tech_rtadmin\AeroQSMS\aeroqsms\vendor\laravel\framework\src\Illuminate\Routing\Router.php(753): Illuminate\Routing\Router->dispatchToRoute(Object(Illuminate\Http\Request))
#47 C:\Users\Tech_rtadmin\AeroQSMS\aeroqsms\vendor\laravel\framework\src\Illuminate\Foundation\Http\Kernel.php(200): Illuminate\Routing\Router->dispatch(Object(Illuminate\Http\Request))
#48 C:\Users\Tech_rtadmin\AeroQSMS\aeroqsms\vendor\laravel\framework\src\Illuminate\Pipeline\Pipeline.php(180): Illuminate\Foundation\Http\Kernel->Illuminate\Foundation\Http\{closure}(Object(Illuminate\Http\Request))
#49 C:\Users\Tech_rtadmin\AeroQSMS\aeroqsms\vendor\laravel\framework\src\Illuminate\Foundation\Http\Middleware\TransformsRequest.php(21): Illuminate\Pipeline\Pipeline->Illuminate\Pipeline\{closure}(Object(Illuminate\Http\Request))
#50 C:\Users\Tech_rtadmin\AeroQSMS\aeroqsms\vendor\laravel\framework\src\Illuminate\Foundation\Http\Middleware\ConvertEmptyStringsToNull.php(31): Illuminate\Foundation\Http\Middleware\TransformsRequest->handle(Object(Illuminate\Http\Request), Object(Closure))
#51 C:\Users\Tech_rtadmin\AeroQSMS\aeroqsms\vendor\laravel\framework\src\Illuminate\Pipeline\Pipeline.php(219): Illuminate\Foundation\Http\Middleware\ConvertEmptyStringsToNull->handle(Object(Illuminate\Http\Request), Object(Closure))
#52 C:\Users\Tech_rtadmin\AeroQSMS\aeroqsms\vendor\laravel\framework\src\Illuminate\Foundation\Http\Middleware\TransformsRequest.php(21): Illuminate\Pipeline\Pipeline->Illuminate\Pipeline\{closure}(Object(Illuminate\Http\Request))
#53 C:\Users\Tech_rtadmin\AeroQSMS\aeroqsms\vendor\laravel\framework\src\Illuminate\Foundation\Http\Middleware\TrimStrings.php(51): Illuminate\Foundation\Http\Middleware\TransformsRequest->handle(Object(Illuminate\Http\Request), Object(Closure))
#54 C:\Users\Tech_rtadmin\AeroQSMS\aeroqsms\vendor\laravel\framework\src\Illuminate\Pipeline\Pipeline.php(219): Illuminate\Foundation\Http\Middleware\TrimStrings->handle(Object(Illuminate\Http\Request), Object(Closure))
#55 C:\Users\Tech_rtadmin\AeroQSMS\aeroqsms\vendor\laravel\framework\src\Illuminate\Http\Middleware\ValidatePostSize.php(27): Illuminate\Pipeline\Pipeline->Illuminate\Pipeline\{closure}(Object(Illuminate\Http\Request))
#56 C:\Users\Tech_rtadmin\AeroQSMS\aeroqsms\vendor\laravel\framework\src\Illuminate\Pipeline\Pipeline.php(219): Illuminate\Http\Middleware\ValidatePostSize->handle(Object(Illuminate\Http\Request), Object(Closure))
#57 C:\Users\Tech_rtadmin\AeroQSMS\aeroqsms\vendor\laravel\framework\src\Illuminate\Foundation\Http\Middleware\PreventRequestsDuringMaintenance.php(109): Illuminate\Pipeline\Pipeline->Illuminate\Pipeline\{closure}(Object(Illuminate\Http\Request))
#58 C:\Users\Tech_rtadmin\AeroQSMS\aeroqsms\vendor\laravel\framework\src\Illuminate\Pipeline\Pipeline.php(219): Illuminate\Foundation\Http\Middleware\PreventRequestsDuringMaintenance->handle(Object(Illuminate\Http\Request), Object(Closure))
#59 C:\Users\Tech_rtadmin\AeroQSMS\aeroqsms\vendor\laravel\framework\src\Illuminate\Http\Middleware\HandleCors.php(61): Illuminate\Pipeline\Pipeline->Illuminate\Pipeline\{closure}(Object(Illuminate\Http\Request))
#60 C:\Users\Tech_rtadmin\AeroQSMS\aeroqsms\vendor\laravel\framework\src\Illuminate\Pipeline\Pipeline.php(219): Illuminate\Http\Middleware\HandleCors->handle(Object(Illuminate\Http\Request), Object(Closure))
#61 C:\Users\Tech_rtadmin\AeroQSMS\aeroqsms\vendor\laravel\framework\src\Illuminate\Http\Middleware\TrustProxies.php(58): Illuminate\Pipeline\Pipeline->Illuminate\Pipeline\{closure}(Object(Illuminate\Http\Request))
#62 C:\Users\Tech_rtadmin\AeroQSMS\aeroqsms\vendor\laravel\framework\src\Illuminate\Pipeline\Pipeline.php(219): Illuminate\Http\Middleware\TrustProxies->handle(Object(Illuminate\Http\Request), Object(Closure))
#63 C:\Users\Tech_rtadmin\AeroQSMS\aeroqsms\vendor\laravel\framework\src\Illuminate\Foundation\Http\Middleware\InvokeDeferredCallbacks.php(22): Illuminate\Pipeline\Pipeline->Illuminate\Pipeline\{closure}(Object(Illuminate\Http\Request))
#64 C:\Users\Tech_rtadmin\AeroQSMS\aeroqsms\vendor\laravel\framework\src\Illuminate\Pipeline\Pipeline.php(219): Illuminate\Foundation\Http\Middleware\InvokeDeferredCallbacks->handle(Object(Illuminate\Http\Request), Object(Closure))
#65 C:\Users\Tech_rtadmin\AeroQSMS\aeroqsms\vendor\laravel\framework\src\Illuminate\Http\Middleware\ValidatePathEncoding.php(26): Illuminate\Pipeline\Pipeline->Illuminate\Pipeline\{closure}(Object(Illuminate\Http\Request))
#66 C:\Users\Tech_rtadmin\AeroQSMS\aeroqsms\vendor\laravel\framework\src\Illuminate\Pipeline\Pipeline.php(219): Illuminate\Http\Middleware\ValidatePathEncoding->handle(Object(Illuminate\Http\Request), Object(Closure))
#67 C:\Users\Tech_rtadmin\AeroQSMS\aeroqsms\vendor\laravel\framework\src\Illuminate\Pipeline\Pipeline.php(137): Illuminate\Pipeline\Pipeline->Illuminate\Pipeline\{closure}(Object(Illuminate\Http\Request))
#68 C:\Users\Tech_rtadmin\AeroQSMS\aeroqsms\vendor\laravel\framework\src\Illuminate\Foundation\Http\Kernel.php(175): Illuminate\Pipeline\Pipeline->then(Object(Closure))
#69 C:\Users\Tech_rtadmin\AeroQSMS\aeroqsms\vendor\laravel\framework\src\Illuminate\Foundation\Http\Kernel.php(144): Illuminate\Foundation\Http\Kernel->sendRequestThroughRouter(Object(Illuminate\Http\Request))
#70 C:\Users\Tech_rtadmin\AeroQSMS\aeroqsms\vendor\laravel\framework\src\Illuminate\Foundation\Testing\Concerns\MakesHttpRequests.php(607): Illuminate\Foundation\Http\Kernel->handle(Object(Illuminate\Http\Request))
#71 C:\Users\Tech_rtadmin\AeroQSMS\aeroqsms\vendor\laravel\framework\src\Illuminate\Foundation\Testing\Concerns\MakesHttpRequests.php(368): Illuminate\Foundation\Testing\TestCase->call('GET', 'http://aeroqsms...', Array, Array, Array, Array)
#72 C:\Users\Tech_rtadmin\AeroQSMS\aeroqsms\tests\Feature\RecommendationTest.php(80): Illuminate\Foundation\Testing\TestCase->get('http://aeroqsms...')
#73 C:\Users\Tech_rtadmin\AeroQSMS\aeroqsms\vendor\pestphp\pest\src\Factories\TestCaseMethodFactory.php(171): P\Tests\Feature\RecommendationTest->{closure}()
#74 [internal function]: P\Tests\Feature\RecommendationTest->Pest\Factories\{closure}()
#75 C:\Users\Tech_rtadmin\AeroQSMS\aeroqsms\vendor\pestphp\pest\src\Concerns\Testable.php(419): call_user_func_array(Object(Closure), Array)
#76 C:\Users\Tech_rtadmin\AeroQSMS\aeroqsms\vendor\pestphp\pest\src\Support\ExceptionTrace.php(26): P\Tests\Feature\RecommendationTest->Pest\Concerns\{closure}()
#77 C:\Users\Tech_rtadmin\AeroQSMS\aeroqsms\vendor\pestphp\pest\src\Concerns\Testable.php(419): Pest\Support\ExceptionTrace::ensure(Object(Closure))
#78 C:\Users\Tech_rtadmin\AeroQSMS\aeroqsms\vendor\pestphp\pest\src\Concerns\Testable.php(321): P\Tests\Feature\RecommendationTest->__callClosure(Object(Closure), Array)
#79 C:\Users\Tech_rtadmin\AeroQSMS\aeroqsms\vendor\pestphp\pest\src\Factories\TestCaseFactory.php(173) : eval()'d code(35): P\Tests\Feature\RecommendationTest->__runTest(Object(Closure))
#80 C:\Users\Tech_rtadmin\AeroQSMS\aeroqsms\vendor\phpunit\phpunit\src\Framework\TestCase.php(1667): P\Tests\Feature\RecommendationTest->__pest_evaluable_authenticated_user_can_view_recommendations_index()
#81 C:\Users\Tech_rtadmin\AeroQSMS\aeroqsms\vendor\phpunit\phpunit\src\Framework\TestCase.php(519): PHPUnit\Framework\TestCase->runTest()
#82 C:\Users\Tech_rtadmin\AeroQSMS\aeroqsms\vendor\phpunit\phpunit\src\Framework\TestRunner\TestRunner.php(87): PHPUnit\Framework\TestCase->runBare()
#83 C:\Users\Tech_rtadmin\AeroQSMS\aeroqsms\vendor\phpunit\phpunit\src\Framework\TestCase.php(365): PHPUnit\Framework\TestRunner->run(Object(P\Tests\Feature\RecommendationTest))
#84 C:\Users\Tech_rtadmin\AeroQSMS\aeroqsms\vendor\phpunit\phpunit\src\Framework\TestSuite.php(369): PHPUnit\Framework\TestCase->run()
#85 C:\Users\Tech_rtadmin\AeroQSMS\aeroqsms\vendor\phpunit\phpunit\src\Framework\TestSuite.php(369): PHPUnit\Framework\TestSuite->run()
#86 C:\Users\Tech_rtadmin\AeroQSMS\aeroqsms\vendor\phpunit\phpunit\src\Framework\TestSuite.php(369): PHPUnit\Framework\TestSuite->run()
#87 C:\Users\Tech_rtadmin\AeroQSMS\aeroqsms\vendor\phpunit\phpunit\src\TextUI\TestRunner.php(64): PHPUnit\Framework\TestSuite->run()
#88 C:\Users\Tech_rtadmin\AeroQSMS\aeroqsms\vendor\phpunit\phpunit\src\TextUI\Application.php(211): PHPUnit\TextUI\TestRunner->run(Object(PHPUnit\TextUI\Configuration\Configuration), Object(PHPUnit\Runner\ResultCache\DefaultResultCache), Object(PHPUnit\Framework\TestSuite))
#89 C:\Users\Tech_rtadmin\AeroQSMS\aeroqsms\vendor\pestphp\pest\src\Kernel.php(103): PHPUnit\TextUI\Application->run(Array)
#90 C:\Users\Tech_rtadmin\AeroQSMS\aeroqsms\vendor\pestphp\pest\bin\pest(184): Pest\Kernel->handle(Array, Array)
#91 C:\Users\Tech_rtadmin\AeroQSMS\aeroqsms\vendor\pestphp\pest\bin\pest(192): {closure}()
#92 {main}

Next Illuminate\View\ViewException: Unable to locate file in Vite manifest: resources/js/Pages/Recommendations/Index.tsx. (View: C:\Users\Tech_rtadmin\AeroQSMS\aeroqsms\resources\views\app.blade.php) in C:\Users\Tech_rtadmin\AeroQSMS\aeroqsms\vendor\laravel\framework\src\Illuminate\Foundation\Vite.php:999
Stack trace:
#0 C:\Users\Tech_rtadmin\AeroQSMS\aeroqsms\vendor\laravel\framework\src\Illuminate\View\Engines\PhpEngine.php(59): Illuminate\View\Engines\CompilerEngine->handleViewException(Object(Illuminate\Foundation\ViteException), 2)
#1 C:\Users\Tech_rtadmin\AeroQSMS\aeroqsms\vendor\laravel\framework\src\Illuminate\View\Engines\CompilerEngine.php(76): Illuminate\View\Engines\PhpEngine->evaluatePath('C:\\Users\\Tech_r...', Array)
#2 C:\Users\Tech_rtadmin\AeroQSMS\aeroqsms\vendor\laravel\framework\src\Illuminate\View\View.php(208): Illuminate\View\Engines\CompilerEngine->get('C:\\Users\\Tech_r...', Array)
#3 C:\Users\Tech_rtadmin\AeroQSMS\aeroqsms\vendor\laravel\framework\src\Illuminate\View\View.php(191): Illuminate\View\View->getContents()
#4 C:\Users\Tech_rtadmin\AeroQSMS\aeroqsms\vendor\laravel\framework\src\Illuminate\View\View.php(160): Illuminate\View\View->renderContents()
#5 C:\Users\Tech_rtadmin\AeroQSMS\aeroqsms\vendor\laravel\framework\src\Illuminate\Http\Response.php(78): Illuminate\View\View->render()
#6 C:\Users\Tech_rtadmin\AeroQSMS\aeroqsms\vendor\laravel\framework\src\Illuminate\Http\Response.php(34): Illuminate\Http\Response->setContent(Object(Illuminate\View\View))
#7 C:\Users\Tech_rtadmin\AeroQSMS\aeroqsms\vendor\laravel\framework\src\Illuminate\Routing\ResponseFactory.php(61): Illuminate\Http\Response->__construct(Object(Illuminate\View\View), 200, Array)
#8 C:\Users\Tech_rtadmin\AeroQSMS\aeroqsms\vendor\laravel\framework\src\Illuminate\Routing\ResponseFactory.php(91): Illuminate\Routing\ResponseFactory->make(Object(Illuminate\View\View), 200, Array)
#9 C:\Users\Tech_rtadmin\AeroQSMS\aeroqsms\vendor\laravel\framework\src\Illuminate\Support\Facades\Facade.php(363): Illuminate\Routing\ResponseFactory->view('app', Array)
#10 C:\Users\Tech_rtadmin\AeroQSMS\aeroqsms\vendor\inertiajs\inertia-laravel\src\Response.php(219): Illuminate\Support\Facades\Facade::__callStatic('view', Array)
#11 C:\Users\Tech_rtadmin\AeroQSMS\aeroqsms\vendor\laravel\framework\src\Illuminate\Routing\Router.php(921): Inertia\Response->toResponse(Object(Illuminate\Http\Request))
#12 C:\Users\Tech_rtadmin\AeroQSMS\aeroqsms\vendor\laravel\framework\src\Illuminate\Routing\Router.php(906): Illuminate\Routing\Router::toResponse(Object(Illuminate\Http\Request), Object(Inertia\Response))
#13 C:\Users\Tech_rtadmin\AeroQSMS\aeroqsms\vendor\laravel\framework\src\Illuminate\Routing\Router.php(821): Illuminate\Routing\Router->prepareResponse(Object(Illuminate\Http\Request), Object(Inertia\Response))
#14 C:\Users\Tech_rtadmin\AeroQSMS\aeroqsms\vendor\laravel\framework\src\Illuminate\Pipeline\Pipeline.php(180): Illuminate\Routing\Router->Illuminate\Routing\{closure}(Object(Illuminate\Http\Request))
#15 C:\Users\Tech_rtadmin\AeroQSMS\aeroqsms\vendor\laravel\framework\src\Illuminate\Auth\Middleware\EnsureEmailIsVerified.php(41): Illuminate\Pipeline\Pipeline->Illuminate\Pipeline\{closure}(Object(Illuminate\Http\Request))
#16 C:\Users\Tech_rtadmin\AeroQSMS\aeroqsms\vendor\laravel\framework\src\Illuminate\Pipeline\Pipeline.php(219): Illuminate\Auth\Middleware\EnsureEmailIsVerified->handle(Object(Illuminate\Http\Request), Object(Closure))
#17 C:\Users\Tech_rtadmin\AeroQSMS\aeroqsms\vendor\laravel\framework\src\Illuminate\Http\Middleware\AddLinkHeadersForPreloadedAssets.php(32): Illuminate\Pipeline\Pipeline->Illuminate\Pipeline\{closure}(Object(Illuminate\Http\Request))
#18 C:\Users\Tech_rtadmin\AeroQSMS\aeroqsms\vendor\laravel\framework\src\Illuminate\Pipeline\Pipeline.php(219): Illuminate\Http\Middleware\AddLinkHeadersForPreloadedAssets->handle(Object(Illuminate\Http\Request), Object(Closure))
#19 C:\Users\Tech_rtadmin\AeroQSMS\aeroqsms\app\Http\Middleware\EnsureAccountActive.php(26): Illuminate\Pipeline\Pipeline->Illuminate\Pipeline\{closure}(Object(Illuminate\Http\Request))
#20 C:\Users\Tech_rtadmin\AeroQSMS\aeroqsms\vendor\laravel\framework\src\Illuminate\Pipeline\Pipeline.php(219): App\Http\Middleware\EnsureAccountActive->handle(Object(Illuminate\Http\Request), Object(Closure))
#21 C:\Users\Tech_rtadmin\AeroQSMS\aeroqsms\vendor\inertiajs\inertia-laravel\src\Middleware.php(122): Illuminate\Pipeline\Pipeline->Illuminate\Pipeline\{closure}(Object(Illuminate\Http\Request))
#22 C:\Users\Tech_rtadmin\AeroQSMS\aeroqsms\vendor\laravel\framework\src\Illuminate\Pipeline\Pipeline.php(219): Inertia\Middleware->handle(Object(Illuminate\Http\Request), Object(Closure))
#23 C:\Users\Tech_rtadmin\AeroQSMS\aeroqsms\vendor\laravel\framework\src\Illuminate\Routing\Middleware\SubstituteBindings.php(50): Illuminate\Pipeline\Pipeline->Illuminate\Pipeline\{closure}(Object(Illuminate\Http\Request))
#24 C:\Users\Tech_rtadmin\AeroQSMS\aeroqsms\vendor\laravel\framework\src\Illuminate\Pipeline\Pipeline.php(219): Illuminate\Routing\Middleware\SubstituteBindings->handle(Object(Illuminate\Http\Request), Object(Closure))
#25 C:\Users\Tech_rtadmin\AeroQSMS\aeroqsms\vendor\laravel\framework\src\Illuminate\Auth\Middleware\Authenticate.php(63): Illuminate\Pipeline\Pipeline->Illuminate\Pipeline\{closure}(Object(Illuminate\Http\Request))
#26 C:\Users\Tech_rtadmin\AeroQSMS\aeroqsms\vendor\laravel\framework\src\Illuminate\Pipeline\Pipeline.php(219): Illuminate\Auth\Middleware\Authenticate->handle(Object(Illuminate\Http\Request), Object(Closure))
#27 C:\Users\Tech_rtadmin\AeroQSMS\aeroqsms\vendor\laravel\framework\src\Illuminate\Foundation\Http\Middleware\VerifyCsrfToken.php(87): Illuminate\Pipeline\Pipeline->Illuminate\Pipeline\{closure}(Object(Illuminate\Http\Request))
#28 C:\Users\Tech_rtadmin\AeroQSMS\aeroqsms\vendor\laravel\framework\src\Illuminate\Pipeline\Pipeline.php(219): Illuminate\Foundation\Http\Middleware\VerifyCsrfToken->handle(Object(Illuminate\Http\Request), Object(Closure))
#29 C:\Users\Tech_rtadmin\AeroQSMS\aeroqsms\vendor\laravel\framework\src\Illuminate\View\Middleware\ShareErrorsFromSession.php(48): Illuminate\Pipeline\Pipeline->Illuminate\Pipeline\{closure}(Object(Illuminate\Http\Request))
#30 C:\Users\Tech_rtadmin\AeroQSMS\aeroqsms\vendor\laravel\framework\src\Illuminate\Pipeline\Pipeline.php(219): Illuminate\View\Middleware\ShareErrorsFromSession->handle(Object(Illuminate\Http\Request), Object(Closure))
#31 C:\Users\Tech_rtadmin\AeroQSMS\aeroqsms\vendor\laravel\framework\src\Illuminate\Session\Middleware\StartSession.php(120): Illuminate\Pipeline\Pipeline->Illuminate\Pipeline\{closure}(Object(Illuminate\Http\Request))
#32 C:\Users\Tech_rtadmin\AeroQSMS\aeroqsms\vendor\laravel\framework\src\Illuminate\Session\Middleware\StartSession.php(63): Illuminate\Session\Middleware\StartSession->handleStatefulRequest(Object(Illuminate\Http\Request), Object(Illuminate\Session\Store), Object(Closure))
#33 C:\Users\Tech_rtadmin\AeroQSMS\aeroqsms\vendor\laravel\framework\src\Illuminate\Pipeline\Pipeline.php(219): Illuminate\Session\Middleware\StartSession->handle(Object(Illuminate\Http\Request), Object(Closure))
#34 C:\Users\Tech_rtadmin\AeroQSMS\aeroqsms\vendor\laravel\framework\src\Illuminate\Cookie\Middleware\AddQueuedCookiesToResponse.php(36): Illuminate\Pipeline\Pipeline->Illuminate\Pipeline\{closure}(Object(Illuminate\Http\Request))
#35 C:\Users\Tech_rtadmin\AeroQSMS\aeroqsms\vendor\laravel\framework\src\Illuminate\Pipeline\Pipeline.php(219): Illuminate\Cookie\Middleware\AddQueuedCookiesToResponse->handle(Object(Illuminate\Http\Request), Object(Closure))
#36 C:\Users\Tech_rtadmin\AeroQSMS\aeroqsms\vendor\laravel\framework\src\Illuminate\Cookie\Middleware\EncryptCookies.php(74): Illuminate\Pipeline\Pipeline->Illuminate\Pipeline\{closure}(Object(Illuminate\Http\Request))
#37 C:\Users\Tech_rtadmin\AeroQSMS\aeroqsms\vendor\laravel\framework\src\Illuminate\Pipeline\Pipeline.php(219): Illuminate\Cookie\Middleware\EncryptCookies->handle(Object(Illuminate\Http\Request), Object(Closure))
#38 C:\Users\Tech_rtadmin\AeroQSMS\aeroqsms\vendor\laravel\framework\src\Illuminate\Pipeline\Pipeline.php(137): Illuminate\Pipeline\Pipeline->Illuminate\Pipeline\{closure}(Object(Illuminate\Http\Request))
#39 C:\Users\Tech_rtadmin\AeroQSMS\aeroqsms\vendor\laravel\framework\src\Illuminate\Routing\Router.php(821): Illuminate\Pipeline\Pipeline->then(Object(Closure))
#40 C:\Users\Tech_rtadmin\AeroQSMS\aeroqsms\vendor\laravel\framework\src\Illuminate\Routing\Router.php(800): Illuminate\Routing\Router->runRouteWithinStack(Object(Illuminate\Routing\Route), Object(Illuminate\Http\Request))
#41 C:\Users\Tech_rtadmin\AeroQSMS\aeroqsms\vendor\laravel\framework\src\Illuminate\Routing\Router.php(764): Illuminate\Routing\Router->runRoute(Object(Illuminate\Http\Request), Object(Illuminate\Routing\Route))
#42 C:\Users\Tech_rtadmin\AeroQSMS\aeroqsms\vendor\laravel\framework\src\Illuminate\Routing\Router.php(753): Illuminate\Routing\Router->dispatchToRoute(Object(Illuminate\Http\Request))
#43 C:\Users\Tech_rtadmin\AeroQSMS\aeroqsms\vendor\laravel\framework\src\Illuminate\Foundation\Http\Kernel.php(200): Illuminate\Routing\Router->dispatch(Object(Illuminate\Http\Request))
#44 C:\Users\Tech_rtadmin\AeroQSMS\aeroqsms\vendor\laravel\framework\src\Illuminate\Pipeline\Pipeline.php(180): Illuminate\Foundation\Http\Kernel->Illuminate\Foundation\Http\{closure}(Object(Illuminate\Http\Request))
#45 C:\Users\Tech_rtadmin\AeroQSMS\aeroqsms\vendor\laravel\framework\src\Illuminate\Foundation\Http\Middleware\TransformsRequest.php(21): Illuminate\Pipeline\Pipeline->Illuminate\Pipeline\{closure}(Object(Illuminate\Http\Request))
#46 C:\Users\Tech_rtadmin\AeroQSMS\aeroqsms\vendor\laravel\framework\src\Illuminate\Foundation\Http\Middleware\ConvertEmptyStringsToNull.php(31): Illuminate\Foundation\Http\Middleware\TransformsRequest->handle(Object(Illuminate\Http\Request), Object(Closure))
#47 C:\Users\Tech_rtadmin\AeroQSMS\aeroqsms\vendor\laravel\framework\src\Illuminate\Pipeline\Pipeline.php(219): Illuminate\Foundation\Http\Middleware\ConvertEmptyStringsToNull->handle(Object(Illuminate\Http\Request), Object(Closure))
#48 C:\Users\Tech_rtadmin\AeroQSMS\aeroqsms\vendor\laravel\framework\src\Illuminate\Foundation\Http\Middleware\TransformsRequest.php(21): Illuminate\Pipeline\Pipeline->Illuminate\Pipeline\{closure}(Object(Illuminate\Http\Request))
#49 C:\Users\Tech_rtadmin\AeroQSMS\aeroqsms\vendor\laravel\framework\src\Illuminate\Foundation\Http\Middleware\TrimStrings.php(51): Illuminate\Foundation\Http\Middleware\TransformsRequest->handle(Object(Illuminate\Http\Request), Object(Closure))
#50 C:\Users\Tech_rtadmin\AeroQSMS\aeroqsms\vendor\laravel\framework\src\Illuminate\Pipeline\Pipeline.php(219): Illuminate\Foundation\Http\Middleware\TrimStrings->handle(Object(Illuminate\Http\Request), Object(Closure))
#51 C:\Users\Tech_rtadmin\AeroQSMS\aeroqsms\vendor\laravel\framework\src\Illuminate\Http\Middleware\ValidatePostSize.php(27): Illuminate\Pipeline\Pipeline->Illuminate\Pipeline\{closure}(Object(Illuminate\Http\Request))
#52 C:\Users\Tech_rtadmin\AeroQSMS\aeroqsms\vendor\laravel\framework\src\Illuminate\Pipeline\Pipeline.php(219): Illuminate\Http\Middleware\ValidatePostSize->handle(Object(Illuminate\Http\Request), Object(Closure))
#53 C:\Users\Tech_rtadmin\AeroQSMS\aeroqsms\vendor\laravel\framework\src\Illuminate\Foundation\Http\Middleware\PreventRequestsDuringMaintenance.php(109): Illuminate\Pipeline\Pipeline->Illuminate\Pipeline\{closure}(Object(Illuminate\Http\Request))
#54 C:\Users\Tech_rtadmin\AeroQSMS\aeroqsms\vendor\laravel\framework\src\Illuminate\Pipeline\Pipeline.php(219): Illuminate\Foundation\Http\Middleware\PreventRequestsDuringMaintenance->handle(Object(Illuminate\Http\Request), Object(Closure))
#55 C:\Users\Tech_rtadmin\AeroQSMS\aeroqsms\vendor\laravel\framework\src\Illuminate\Http\Middleware\HandleCors.php(61): Illuminate\Pipeline\Pipeline->Illuminate\Pipeline\{closure}(Object(Illuminate\Http\Request))
#56 C:\Users\Tech_rtadmin\AeroQSMS\aeroqsms\vendor\laravel\framework\src\Illuminate\Pipeline\Pipeline.php(219): Illuminate\Http\Middleware\HandleCors->handle(Object(Illuminate\Http\Request), Object(Closure))
#57 C:\Users\Tech_rtadmin\AeroQSMS\aeroqsms\vendor\laravel\framework\src\Illuminate\Http\Middleware\TrustProxies.php(58): Illuminate\Pipeline\Pipeline->Illuminate\Pipeline\{closure}(Object(Illuminate\Http\Request))
#58 C:\Users\Tech_rtadmin\AeroQSMS\aeroqsms\vendor\laravel\framework\src\Illuminate\Pipeline\Pipeline.php(219): Illuminate\Http\Middleware\TrustProxies->handle(Object(Illuminate\Http\Request), Object(Closure))
#59 C:\Users\Tech_rtadmin\AeroQSMS\aeroqsms\vendor\laravel\framework\src\Illuminate\Foundation\Http\Middleware\InvokeDeferredCallbacks.php(22): Illuminate\Pipeline\Pipeline->Illuminate\Pipeline\{closure}(Object(Illuminate\Http\Request))
#60 C:\Users\Tech_rtadmin\AeroQSMS\aeroqsms\vendor\laravel\framework\src\Illuminate\Pipeline\Pipeline.php(219): Illuminate\Foundation\Http\Middleware\InvokeDeferredCallbacks->handle(Object(Illuminate\Http\Request), Object(Closure))
#61 C:\Users\Tech_rtadmin\AeroQSMS\aeroqsms\vendor\laravel\framework\src\Illuminate\Http\Middleware\ValidatePathEncoding.php(26): Illuminate\Pipeline\Pipeline->Illuminate\Pipeline\{closure}(Object(Illuminate\Http\Request))
#62 C:\Users\Tech_rtadmin\AeroQSMS\aeroqsms\vendor\laravel\framework\src\Illuminate\Pipeline\Pipeline.php(219): Illuminate\Http\Middleware\ValidatePathEncoding->handle(Object(Illuminate\Http\Request), Object(Closure))
#63 C:\Users\Tech_rtadmin\AeroQSMS\aeroqsms\vendor\laravel\framework\src\Illuminate\Pipeline\Pipeline.php(137): Illuminate\Pipeline\Pipeline->Illuminate\Pipeline\{closure}(Object(Illuminate\Http\Request))
#64 C:\Users\Tech_rtadmin\AeroQSMS\aeroqsms\vendor\laravel\framework\src\Illuminate\Foundation\Http\Kernel.php(175): Illuminate\Pipeline\Pipeline->then(Object(Closure))
#65 C:\Users\Tech_rtadmin\AeroQSMS\aeroqsms\vendor\laravel\framework\src\Illuminate\Foundation\Http\Kernel.php(144): Illuminate\Foundation\Http\Kernel->sendRequestThroughRouter(Object(Illuminate\Http\Request))
#66 C:\Users\Tech_rtadmin\AeroQSMS\aeroqsms\vendor\laravel\framework\src\Illuminate\Foundation\Testing\Concerns\MakesHttpRequests.php(607): Illuminate\Foundation\Http\Kernel->handle(Object(Illuminate\Http\Request))
#67 C:\Users\Tech_rtadmin\AeroQSMS\aeroqsms\vendor\laravel\framework\src\Illuminate\Foundation\Testing\Concerns\MakesHttpRequests.php(368): Illuminate\Foundation\Testing\TestCase->call('GET', 'http://aeroqsms...', Array, Array, Array, Array)
#68 C:\Users\Tech_rtadmin\AeroQSMS\aeroqsms\tests\Feature\RecommendationTest.php(80): Illuminate\Foundation\Testing\TestCase->get('http://aeroqsms...')
#69 C:\Users\Tech_rtadmin\AeroQSMS\aeroqsms\vendor\pestphp\pest\src\Factories\TestCaseMethodFactory.php(171): P\Tests\Feature\RecommendationTest->{closure}()
#70 [internal function]: P\Tests\Feature\RecommendationTest->Pest\Factories\{closure}()
#71 C:\Users\Tech_rtadmin\AeroQSMS\aeroqsms\vendor\pestphp\pest\src\Concerns\Testable.php(419): call_user_func_array(Object(Closure), Array)
#72 C:\Users\Tech_rtadmin\AeroQSMS\aeroqsms\vendor\pestphp\pest\src\Support\ExceptionTrace.php(26): P\Tests\Feature\RecommendationTest->Pest\Concerns\{closure}()
#73 C:\Users\Tech_rtadmin\AeroQSMS\aeroqsms\vendor\pestphp\pest\src\Concerns\Testable.php(419): Pest\Support\ExceptionTrace::ensure(Object(Closure))
#74 C:\Users\Tech_rtadmin\AeroQSMS\aeroqsms\vendor\pestphp\pest\src\Concerns\Testable.php(321): P\Tests\Feature\RecommendationTest->__callClosure(Object(Closure), Array)
#75 C:\Users\Tech_rtadmin\AeroQSMS\aeroqsms\vendor\pestphp\pest\src\Factories\TestCaseFactory.php(173) : eval()'d code(35): P\Tests\Feature\RecommendationTest->__runTest(Object(Closure))
#76 C:\Users\Tech_rtadmin\AeroQSMS\aeroqsms\vendor\phpunit\phpunit\src\Framework\TestCase.php(1667): P\Tests\Feature\RecommendationTest->__pest_evaluable_authenticated_user_can_view_recommendations_index()
#77 C:\Users\Tech_rtadmin\AeroQSMS\aeroqsms\vendor\phpunit\phpunit\src\Framework\TestCase.php(519): PHPUnit\Framework\TestCase->runTest()
#78 C:\Users\Tech_rtadmin\AeroQSMS\aeroqsms\vendor\phpunit\phpunit\src\Framework\TestRunner\TestRunner.php(87): PHPUnit\Framework\TestCase->runBare()
#79 C:\Users\Tech_rtadmin\AeroQSMS\aeroqsms\vendor\phpunit\phpunit\src\Framework\TestCase.php(365): PHPUnit\Framework\TestRunner->run(Object(P\Tests\Feature\RecommendationTest))
#80 C:\Users\Tech_rtadmin\AeroQSMS\aeroqsms\vendor\phpunit\phpunit\src\Framework\TestSuite.php(369): PHPUnit\Framework\TestCase->run()
#81 C:\Users\Tech_rtadmin\AeroQSMS\aeroqsms\vendor\phpunit\phpunit\src\Framework\TestSuite.php(369): PHPUnit\Framework\TestSuite->run()
#82 C:\Users\Tech_rtadmin\AeroQSMS\aeroqsms\vendor\phpunit\phpunit\src\Framework\TestSuite.php(369): PHPUnit\Framework\TestSuite->run()
#83 C:\Users\Tech_rtadmin\AeroQSMS\aeroqsms\vendor\phpunit\phpunit\src\TextUI\TestRunner.php(64): PHPUnit\Framework\TestSuite->run()
#84 C:\Users\Tech_rtadmin\AeroQSMS\aeroqsms\vendor\phpunit\phpunit\src\TextUI\Application.php(211): PHPUnit\TextUI\TestRunner->run(Object(PHPUnit\TextUI\Configuration\Configuration), Object(PHPUnit\Runner\ResultCache\DefaultResultCache), Object(PHPUnit\Framework\TestSuite))
#85 C:\Users\Tech_rtadmin\AeroQSMS\aeroqsms\vendor\pestphp\pest\src\Kernel.php(103): PHPUnit\TextUI\Application->run(Array)
#86 C:\Users\Tech_rtadmin\AeroQSMS\aeroqsms\vendor\pestphp\pest\bin\pest(184): Pest\Kernel->handle(Array, Array)
#87 C:\Users\Tech_rtadmin\AeroQSMS\aeroqsms\vendor\pestphp\pest\bin\pest(192): {closure}()
#88 {main}

----------------------------------------------------------------------------------

Unable to locate file in Vite manifest: resources/js/Pages/Recommendations/Index.tsx. (View: C:\Users\Tech_rtadmin\AeroQSMS\aeroqsms\resources\views\app.blade.php)

  at tests\Feature\RecommendationTest.php:81
     77▕ 
     78▕ test('authenticated user can view recommendations index', function () {
     79▕     $this->actingAs($this->safety)
     80▕         ->get(route('recommendations.index'))
  ➜  81▕         ->assertOk();
     82▕ });
     83▕


  Tests:    1 failed, 78 passed (167 assertions)
  Duration: 362.86s

